{"text_format":"1","workbook":"xlsx","n_sheets":16,"sheets":["はじめに","TOP","概要","説明①","説明②","説明③","アンケート","印刷","１回目","２回目","４回目","３回目","５回目","データ","素朴概念集","ファシリテーション集"],"not_rendered":{"charts":3,"images":15,"macros":1,"external_links":0,"defined_names":11,"comments":0,"pivot_tables":0},"unopened":[],"bounds":{"document_bytes":16777216,"sheet_cells":100000,"rows_first":2000,"rows_last":500,"rows_between":2000,"halvings":0,"cell_chars":16384,"cell_head_chars":4096},"cells_cut":0,"cells_raw":0,"read":"whole","date_system":"1900"}

{"sheet":"はじめに","index":0,"n_rows":0,"n_cols":0,"rows_kept":0,"cut":false,"hidden":false,"merged":[]}

{"sheet":"TOP","index":1,"n_rows":0,"n_cols":0,"rows_kept":0,"cut":false,"hidden":false,"merged":[]}

{"sheet":"概要","index":2,"n_rows":0,"n_cols":0,"rows_kept":0,"cut":false,"hidden":false,"merged":[]}

{"sheet":"説明①","index":3,"n_rows":0,"n_cols":0,"rows_kept":0,"cut":false,"hidden":false,"merged":[]}

{"sheet":"説明②","index":4,"n_rows":0,"n_cols":0,"rows_kept":0,"cut":false,"hidden":false,"merged":[]}

{"sheet":"説明③","index":5,"n_rows":0,"n_cols":0,"rows_kept":0,"cut":false,"hidden":false,"merged":[]}

{"sheet":"アンケート","index":6,"n_rows":25,"n_cols":13,"rows_kept":25,"cut":false,"hidden":false,"merged":[[8,6,9,6],[8,7,9,7],[8,8,9,8],[8,12,9,12]]}
[]
[]
[null,null,null,null,null,null,null,null,null,null,null,null,"３年　　 組　　 番　名前　　　　　　　　　　　　"]
[null,null,null,null,null,null,"理科のじゅぎょうアンケート"]
[]
[null,null,null,null,null,null,"　これまでの理科のじゅぎょうでやったことがあるかを聞くアンケートです。​しつ問にあてはまる番号を○でかこんでください。"]
{"$rows_left_out":20}
{"sheet":"印刷","index":7,"n_rows":9,"n_cols":48,"rows_kept":9,"cut":false,"hidden":false,"merged":[[5,1,5,3]]}
[]
[null,null,"学年","組",null,null,"［児童用］",null,null,null,null,null,null,null,null,null,null,null,null,null,null,null,null,null,null,"［教師用］",null,null,null,null,null,null,null,null,null,null,null,null,null,null,null,null,null,null,null,null,null,"アンケートの質問と学習シートとのおおまかな関連です。授業との関連を詳"]
[null,null,"３","３",null,null,null,null,null,null,null,null,null,null,null,null,null,null,null,null,null,null,null,null,null,null,null,null,null,null,null,null,null,null,null,null,null,null,null,null,null,null,null,null,null,null,null,"しく知りたい場合や、ファシリテーションの方法を知りたい場合は、こちら→"]
[null,null,null,"番号を入力",null,null,null,null,null,null,null,null,null,null,null,null,null,null,null,null,null,null,{"$f":"\"令和 \"&$B$9&\" 年 \"&$C$9&\" 月 \"&$D$9&\" 日\"","v":"令和 7 年 9 月 15 日"},null,null,null,null,null,null,null,null,null,null,null,null,null,null,null,null,null,null,null,null,null,{"$f":"\"令和 \"&$B$9&\" 年 \"&$C$9&\" 月 \"&$D$9&\" 日\"","v":"令和 7 年 9 月 15 日"}]
[null,null,null,"(組 & 番、３桁)"]
[null,302,null,null,null,"理科のじゅぎょうアンケート　かくにんシート",null,null,null,null,null,null,null,null,null,null,null,null,null,null,null,null,null,null,"【理科】「分析して解釈する力」成長チェックシート"]
{"$rows_left_out":4}
{"sheet":"１回目","index":8,"n_rows":51,"n_cols":23,"rows_kept":51,"cut":false,"hidden":false,"merged":[]}
[]
[null,null,"日時","2025-09-07"]
[null,null,"単元","単元なし"]
[null,null,"節","なし"]
["N0.","組","番号","氏　名","Q１","Q２","Q３","Q４","Q５","Q６","Q７","Q８","Q９","Q10","Q11","Q12","Q13","Q14","Q15","抽・整","関・傾","問題の設定","全体"]
[{"$f":"IF(C6=\"\",\"\",B6*100+C6)","v":301},{"$f":"IF(C6=\"\",\"\",印刷!$D$3)","v":"３"},1,"名取　せり",3,3,3,3,3,3,3,3,3,3,3,3,3,3,3,{"$f":"IF(COUNT(E6:K6)=0,\"\",AVERAGE(E6:K6))","v":3},{"$f":"IF(COUNT(K6:O6)=0,\"\",AVERAGE(K6:O6))","v":3},{"$f":"IF(COUNT(P6:S6)=0,\"\",AVERAGE(P6:S6))","v":3},{"$f":"IF(COUNT(E6:S6)=0,\"\",AVERAGE(E6:S6))","v":3}]
{"$rows_left_out":46}
{"sheet":"２回目","index":9,"n_rows":51,"n_cols":23,"rows_kept":51,"cut":false,"hidden":false,"merged":[]}
[]
[null,null,"日時","2025-09-15"]
[null,null,"単元","こん虫のかんさつ"]
[null,null,"節"]
["N0.","組","番号","氏　名","Q１","Q２","Q３","Q４","Q５","Q６","Q７","Q８","Q９","Q10","Q11","Q12","Q13","Q14","Q15","抽・整","関・傾","問題の設定","全体"]
[{"$f":"IF(C6=\"\",\"\",B6*100+C6)","v":301},{"$f":"IF(C6=\"\",\"\",印刷!$D$3)","v":"３"},1,null,4,4,4,4,4,3,3,3,3,3,3,3,3,3,3,{"$f":"IF(COUNT(E6:K6)=0,\"\",AVERAGE(E6:K6))","v":3.7142857142857144},{"$f":"IF(COUNT(K6:O6)=0,\"\",AVERAGE(K6:O6))","v":3},{"$f":"IF(COUNT(P6:S6)=0,\"\",AVERAGE(P6:S6))","v":3},{"$f":"IF(COUNT(E6:S6)=0,\"\",AVERAGE(E6:S6))","v":3.3333333333333335}]
{"$rows_left_out":46}
{"sheet":"４回目","index":10,"n_rows":51,"n_cols":23,"rows_kept":51,"cut":false,"hidden":false,"merged":[]}
[]
[null,null,"日時","2025-12-01"]
[null,null,"単元","物の重さ"]
[null,null,"節"]
["N0.","組","番号","氏　名","Q１","Q２","Q３","Q４","Q５","Q６","Q７","Q８","Q９","Q10","Q11","Q12","Q13","Q14","Q15","抽・整","関・傾","問題の設定","全体"]
[{"$f":"IF(C6=\"\",\"\",B6*100+C6)","v":301},{"$f":"IF(C6=\"\",\"\",印刷!$D$3)","v":"３"},1,null,5,4,4,4,4,4,4,4,4,4,3,3,3,3,3,{"$f":"IF(COUNT(E6:K6)=0,\"\",AVERAGE(E6:K6))","v":4.1428571428571432},{"$f":"IF(COUNT(K6:O6)=0,\"\",AVERAGE(K6:O6))","v":3.8},{"$f":"IF(COUNT(P6:S6)=0,\"\",AVERAGE(P6:S6))","v":3},{"$f":"IF(COUNT(E6:S6)=0,\"\",AVERAGE(E6:S6))","v":3.7333333333333334}]
{"$rows_left_out":46}
{"sheet":"３回目","index":11,"n_rows":51,"n_cols":23,"rows_kept":51,"cut":false,"hidden":false,"merged":[]}
[]
[null,null,"日時","2025-11-15"]
[null,null,"単元","音のせいしつ"]
[null,null,"節"]
["N0.","組","番号","氏　名","Q１","Q２","Q３","Q４","Q５","Q６","Q７","Q８","Q９","Q10","Q11","Q12","Q13","Q14","Q15","抽・整","関・傾","問題の設定","全体"]
[{"$f":"IF(C6=\"\",\"\",B6*100+C6)","v":301},{"$f":"IF(C6=\"\",\"\",印刷!$D$3)","v":"３"},1,null,4,4,4,4,4,3,3,3,3,3,3,3,3,3,3,{"$f":"IF(COUNT(E6:K6)=0,\"\",AVERAGE(E6:K6))","v":3.7142857142857144},{"$f":"IF(COUNT(K6:O6)=0,\"\",AVERAGE(K6:O6))","v":3},{"$f":"IF(COUNT(P6:S6)=0,\"\",AVERAGE(P6:S6))","v":3},{"$f":"IF(COUNT(E6:S6)=0,\"\",AVERAGE(E6:S6))","v":3.3333333333333335}]
{"$rows_left_out":46}
{"sheet":"５回目","index":12,"n_rows":51,"n_cols":23,"rows_kept":51,"cut":false,"hidden":false,"merged":[]}
[]
[null,null,"日時","2026-01-30"]
[null,null,"単元","じしゃくのせいしつ"]
[null,null,"節"]
["N0.","組","番号","氏　名","Q１","Q２","Q３","Q４","Q５","Q６","Q７","Q８","Q９","Q10","Q11","Q12","Q13","Q14","Q15","抽・整","関・傾","問題の設定","全体"]
[{"$f":"IF(C6=\"\",\"\",B6*100+C6)","v":301},{"$f":"IF(C6=\"\",\"\",印刷!$D$3)","v":"３"},1,null,5,5,5,5,5,5,5,5,5,5,5,5,5,5,5,{"$f":"IF(COUNT(E6:K6)=0,\"\",AVERAGE(E6:K6))","v":5},{"$f":"IF(COUNT(K6:O6)=0,\"\",AVERAGE(K6:O6))","v":5},{"$f":"IF(COUNT(P6:S6)=0,\"\",AVERAGE(P6:S6))","v":5},{"$f":"IF(COUNT(E6:S6)=0,\"\",AVERAGE(E6:S6))","v":5}]
{"$rows_left_out":46}
{"sheet":"データ","index":13,"n_rows":8,"n_cols":52,"rows_kept":8,"cut":false,"hidden":true,"merged":[[2,1,2,2],[6,1,6,2],[7,45,7,46],[7,1,7,2],[3,1,3,2],[4,1,4,2],[5,1,5,2],[2,45,2,46],[3,45,3,46],[4,45,4,46],[5,45,5,46],[6,45,6,46]]}
[]
[null,null,null,null,null,null,null,null,null,null,null,null,null,null,null,null,null,null,null,null,null,null,null,null,null,null,null,null,null,null,null,null,null,null,null,null,null,null,"個人",null,null,null,null,null,null,"クラス全体"]
[null,"回数　単元名",null,"実施日","Q１","Q２","Q３","Q４","Q５","Q６","Q７","Q８","Q９","Q10","Q11","Q12","Q13","Q14","Q15",null,null,"日にち","Q１","Q２","Q３","Q４","Q５","Q６","Q７","Q８","Q９","Q10","Q11","Q12","Q13","Q14","Q15",null,null,"抽出・整理","関係性や傾向","問題の設定","全体",null,null,"回数　単元名",null,"実施日","抽出・整理","関係性や傾向","問題の設定","全体"]
[null,{"$f":"IF('１回目'!$D$3=\"\",\"\",\"１回目\"&\" 『\"&'１回目'!$D$3&\"』\")","v":"１回目 『単元なし』"},null,{"$f":"IF('１回目'!$D$2=\"\",\"\",'１回目'!$D$2)","v":"2025-09-07"},{"$f":"IF('１回目'!E$51=\"\",\"\",'１回目'!E$51)","v":3.5},{"$f":"IF('１回目'!F$51=\"\",\"\",'１回目'!F$51)","v":3.5},{"$f":"IF('１回目'!G$51=\"\",\"\",'１回目'!G$51)","v":3},{"$f":"IF('１回目'!H$51=\"\",\"\",'１回目'!H$51)","v":3},{"$f":"IF('１回目'!I$51=\"\",\"\",'１回目'!I$51)","v":3},{"$f":"IF('１回目'!J$51=\"\",\"\",'１回目'!J$51)","v":3},{"$f":"IF('１回目'!K$51=\"\",\"\",'１回目'!K$51)","v":3},{"$f":"IF('１回目'!L$51=\"\",\"\",'１回目'!L$51)","v":2.5},{"$f":"IF('１回目'!M$51=\"\",\"\",'１回目'!M$51)","v":3},{"$f":"IF('１回目'!N$51=\"\",\"\",'１回目'!N$51)","v":3},{"$f":"IF('１回目'!O$51=\"\",\"\",'１回目'!O$51)","v":3},{"$f":"IF('１回目'!P$51=\"\",\"\",'１回目'!P$51)","v":3},{"$f":"IF('１回目'!Q$51=\"\",\"\",'１回目'!Q$51)","v":3},{"$f":"IF('１回目'!R$51=\"\",\"\",'１回目'!R$51)","v":3},{"$f":"IF('１回目'!S$51=\"\",\"\",'１回目'!S$51)","v":3},null,"１回目",{"$f":"IF('１回目'!$D$2=\"\",\"\",'１回目'!$D$2)","v":"2025-09-07"},{"$f":"IF(VLOOKUP(印刷!$B$6,'１回目'!$A$5:$W$50,5,FALSE)=\"\",\"\",VLOOKUP(印刷!$B$6,'１回目'!$A$5:$W$50,5,FALSE))","v":4},{"$f":"IF(VLOOKUP(印刷!$B$6,'１回目'!$A$5:$W$50,6,FALSE)=\"\",\"\",VLOOKUP(印刷!$B$6,'１回目'!$A$5:$W$50,6,FALSE))","v":4},{"$f":"IF(VLOOKUP(印刷!$B$6,'１回目'!$A$5:$W$50,7,FALSE)=\"\",\"\",VLOOKUP(印刷!$B$6,'１回目'!$A$5:$W$50,7,FALSE))","v":3},{"$f":"IF(VLOOKUP(印刷!$B$6,'１回目'!$A$5:$W$50,8,FALSE)=\"\",\"\",VLOOKUP(印刷!$B$6,'１回目'!$A$5:$W$50,8,FALSE))","v":3},{"$f":"IF(VLOOKUP(印刷!$B$6,'１回目'!$A$5:$W$50,9,FALSE)=\"\",\"\",VLOOKUP(印刷!$B$6,'１回目'!$A$5:$W$50,9,FALSE))","v":3},{"$f":"IF(VLOOKUP(印刷!$B$6,'１回目'!$A$5:$W$50,10,FALSE)=\"\",\"\",VLOOKUP(印刷!$B$6,'１回目'!$A$5:$W$50,10,FALSE))","v":3},{"$f":"IF(VLOOKUP(印刷!$B$6,'１回目'!$A$5:$W$50,11,FALSE)=\"\",\"\",VLOOKUP(印刷!$B$6,'１回目'!$A$5:$W$50,11,FALSE))","v":3},{"$f":"IF(VLOOKUP(印刷!$B$6,'１回目'!$A$5:$W$50,12,FALSE)=\"\",\"\",VLOOKUP(印刷!$B$6,'１回目'!$A$5:$W$50,12,FALSE))","v":2},{"$f":"IF(VLOOKUP(印刷!$B$6,'１回目'!$A$5:$W$50,13,FALSE)=\"\",\"\",VLOOKUP(印刷!$B$6,'１回目'!$A$5:$W$50,13,FALSE))","v":3},{"$f":"IF(VLOOKUP(印刷!$B$6,'１回目'!$A$5:$W$50,14,FALSE)=\"\",\"\",VLOOKUP(印刷!$B$6,'１回目'!$A$5:$W$50,14,FALSE))","v":3},{"$f":"IF(VLOOKUP(印刷!$B$6,'１回目'!$A$5:$W$50,15,FALSE)=\"\",\"\",VLOOKUP(印刷!$B$6,'１回目'!$A$5:$W$50,15,FALSE))","v":3},{"$f":"IF(VLOOKUP(印刷!$B$6,'１回目'!$A$5:$W$50,16,FALSE)=\"\",\"\",VLOOKUP(印刷!$B$6,'１回目'!$A$5:$W$50,16,FALSE))","v":3},{"$f":"IF(VLOOKUP(印刷!$B$6,'１回目'!$A$5:$W$50,17,FALSE)=\"\",\"\",VLOOKUP(印刷!$B$6,'１回目'!$A$5:$W$50,17,FALSE))","v":3},{"$f":"IF(VLOOKUP(印刷!$B$6,'１回目'!$A$5:$W$50,18,FALSE)=\"\",\"\",VLOOKUP(印刷!$B$6,'１回目'!$A$5:$W$50,18,FALSE))","v":3},{"$f":"IF(VLOOKUP(印刷!$B$6,'１回目'!$A$5:$W$50,19,FALSE)=\"\",\"\",VLOOKUP(印刷!$B$6,'１回目'!$A$5:$W$50,19,FALSE))","v":3},null,"１回目",{"$f":"IF(VLOOKUP(印刷!$B$6,'１回目'!$A$5:$W$50,20,FALSE)=\"\",\"\",VLOOKUP(印刷!$B$6,'１回目'!$A$5:$W$50,20,FALSE))","v":3.2857142857142856},{"$f":"IF(VLOOKUP(印刷!$B$6,'１回目'!$A$5:$W$50,21,FALSE)=\"\",\"\",VLOOKUP(印刷!$B$6,'１回目'!$A$5:$W$50,21,FALSE))","v":2.8},{"$f":"IF(VLOOKUP(印刷!$B$6,'１回目'!$A$5:$W$50,22,FALSE)=\"\",\"\",VLOOKUP(印刷!$B$6,'１回目'!$A$5:$W$50,22,FALSE))","v":3},{"$f":"IF(VLOOKUP(印刷!$B$6,'１回目'!$A$5:$W$50,23,FALSE)=\"\",\"\",VLOOKUP(印刷!$B$6,'１回目'!$A$5:$W$50,23,FALSE))","v":3.0666666666666669},null,null,{"$f":"IF('１回目'!$D$3=\"\",\"\",\"１回目\"&\" 『\"&'１回目'!$D$3&\"』\")","v":"１回目 『単元なし』"},null,{"$f":"IF('１回目'!$D$2=\"\",\"\",'１回目'!$D$2)","v":"2025-09-07"},{"$f":"IF('１回目'!$T$51=\"\",\"\",'１回目'!$T$51)","v":3.1428571428571428},{"$f":"IF('１回目'!$U$51=\"\",\"\",'１回目'!$U$51)","v":2.9},{"$f":"IF('１回目'!$V$51=\"\",\"\",'１回目'!$V$51)","v":3},{"$f":"IF('１回目'!$W$51=\"\",\"\",'１回目'!$W$51)","v":3.0333333333333332}]
[null,{"$f":"IF('２回目'!$D$3=\"\",\"\",\"２回目\"&\" 『\"&'２回目'!$D$3&\"』\")","v":"２回目 『こん虫のかんさつ』"},null,{"$f":"IF('２回目'!$D$2=\"\",\"\",'２回目'!$D$2)","v":"2025-09-15"},{"$f":"IF('２回目'!E$51=\"\",\"\",'２回目'!E$51)","v":4.5},{"$f":"IF('２回目'!F$51=\"\",\"\",'２回目'!F$51)","v":4},{"$f":"IF('２回目'!G$51=\"\",\"\",'２回目'!G$51)","v":4},{"$f":"IF('２回目'!H$51=\"\",\"\",'２回目'!H$51)","v":4},{"$f":"IF('２回目'!I$51=\"\",\"\",'２回目'!I$51)","v":4},{"$f":"IF('２回目'!J$51=\"\",\"\",'２回目'!J$51)","v":3},{"$f":"IF('２回目'!K$51=\"\",\"\",'２回目'!K$51)","v":3},{"$f":"IF('２回目'!L$51=\"\",\"\",'２回目'!L$51)","v":2.5},{"$f":"IF('２回目'!M$51=\"\",\"\",'２回目'!M$51)","v":3},{"$f":"IF('２回目'!N$51=\"\",\"\",'２回目'!N$51)","v":3},{"$f":"IF('２回目'!O$51=\"\",\"\",'２回目'!O$51)","v":3},{"$f":"IF('２回目'!P$51=\"\",\"\",'２回目'!P$51)","v":3},{"$f":"IF('２回目'!Q$51=\"\",\"\",'２回目'!Q$51)","v":3},{"$f":"IF('２回目'!R$51=\"\",\"\",'２回目'!R$51)","v":3},{"$f":"IF('２回目'!S$51=\"\",\"\",'２回目'!S$51)","v":3},null,"２回目",{"$f":"IF('２回目'!$D$2=\"\",\"\",'２回目'!$D$2)","v":"2025-09-15"},{"$f":"IF(VLOOKUP(印刷!$B$6,'２回目'!$A$5:$W$50,5,FALSE)=\"\",\"\",VLOOKUP(印刷!$B$6,'２回目'!$A$5:$W$50,5,FALSE))","v":5},{"$f":"IF(VLOOKUP(印刷!$B$6,'２回目'!$A$5:$W$50,6,FALSE)=\"\",\"\",VLOOKUP(印刷!$B$6,'２回目'!$A$5:$W$50,6,FALSE))","v":4},{"$f":"IF(VLOOKUP(印刷!$B$6,'２回目'!$A$5:$W$50,7,FALSE)=\"\",\"\",VLOOKUP(印刷!$B$6,'２回目'!$A$5:$W$50,7,FALSE))","v":4},{"$f":"IF(VLOOKUP(印刷!$B$6,'２回目'!$A$5:$W$50,8,FALSE)=\"\",\"\",VLOOKUP(印刷!$B$6,'２回目'!$A$5:$W$50,8,FALSE))","v":4},{"$f":"IF(VLOOKUP(印刷!$B$6,'２回目'!$A$5:$W$50,9,FALSE)=\"\",\"\",VLOOKUP(印刷!$B$6,'２回目'!$A$5:$W$50,9,FALSE))","v":4},{"$f":"IF(VLOOKUP(印刷!$B$6,'２回目'!$A$5:$W$50,10,FALSE)=\"\",\"\",VLOOKUP(印刷!$B$6,'２回目'!$A$5:$W$50,10,FALSE))","v":3},{"$f":"IF(VLOOKUP(印刷!$B$6,'２回目'!$A$5:$W$50,11,FALSE)=\"\",\"\",VLOOKUP(印刷!$B$6,'２回目'!$A$5:$W$50,11,FALSE))","v":3},{"$f":"IF(VLOOKUP(印刷!$B$6,'２回目'!$A$5:$W$50,12,FALSE)=\"\",\"\",VLOOKUP(印刷!$B$6,'２回目'!$A$5:$W$50,12,FALSE))","v":2},{"$f":"IF(VLOOKUP(印刷!$B$6,'２回目'!$A$5:$W$50,13,FALSE)=\"\",\"\",VLOOKUP(印刷!$B$6,'２回目'!$A$5:$W$50,13,FALSE))","v":3},{"$f":"IF(VLOOKUP(印刷!$B$6,'２回目'!$A$5:$W$50,14,FALSE)=\"\",\"\",VLOOKUP(印刷!$B$6,'２回目'!$A$5:$W$50,14,FALSE))","v":3},{"$f":"IF(VLOOKUP(印刷!$B$6,'２回目'!$A$5:$W$50,15,FALSE)=\"\",\"\",VLOOKUP(印刷!$B$6,'２回目'!$A$5:$W$50,15,FALSE))","v":3},{"$f":"IF(VLOOKUP(印刷!$B$6,'２回目'!$A$5:$W$50,16,FALSE)=\"\",\"\",VLOOKUP(印刷!$B$6,'２回目'!$A$5:$W$50,16,FALSE))","v":3},{"$f":"IF(VLOOKUP(印刷!$B$6,'２回目'!$A$5:$W$50,17,FALSE)=\"\",\"\",VLOOKUP(印刷!$B$6,'２回目'!$A$5:$W$50,17,FALSE))","v":3},{"$f":"IF(VLOOKUP(印刷!$B$6,'２回目'!$A$5:$W$50,18,FALSE)=\"\",\"\",VLOOKUP(印刷!$B$6,'２回目'!$A$5:$W$50,18,FALSE))","v":3},{"$f":"IF(VLOOKUP(印刷!$B$6,'２回目'!$A$5:$W$50,19,FALSE)=\"\",\"\",VLOOKUP(印刷!$B$6,'２回目'!$A$5:$W$50,19,FALSE))","v":3},null,"２回目",{"$f":"IF(VLOOKUP(印刷!$B$6,'２回目'!$A$5:$W$50,20,FALSE)=\"\",\"\",VLOOKUP(印刷!$B$6,'２回目'!$A$5:$W$50,20,FALSE))","v":3.8571428571428572},{"$f":"IF(VLOOKUP(印刷!$B$6,'２回目'!$A$5:$W$50,21,FALSE)=\"\",\"\",VLOOKUP(印刷!$B$6,'２回目'!$A$5:$W$50,21,FALSE))","v":2.8},{"$f":"IF(VLOOKUP(印刷!$B$6,'２回目'!$A$5:$W$50,22,FALSE)=\"\",\"\",VLOOKUP(印刷!$B$6,'２回目'!$A$5:$W$50,22,FALSE))","v":3},{"$f":"IF(VLOOKUP(印刷!$B$6,'２回目'!$A$5:$W$50,23,FALSE)=\"\",\"\",VLOOKUP(印刷!$B$6,'２回目'!$A$5:$W$50,23,FALSE))","v":3.3333333333333335},null,null,{"$f":"IF('２回目'!$D$3=\"\",\"\",\"２回目\"&\" 『\"&'２回目'!$D$3&\"』\")","v":"２回目 『こん虫のかんさつ』"},null,{"$f":"IF('２回目'!$D$2=\"\",\"\",'２回目'!$D$2)","v":"2025-09-15"},{"$f":"IF('２回目'!$T$51=\"\",\"\",'２回目'!$T$51)","v":3.7857142857142856},{"$f":"IF('２回目'!$U$51=\"\",\"\",'２回目'!$U$51)","v":2.9},{"$f":"IF('２回目'!$V$51=\"\",\"\",'２回目'!$V$51)","v":3},{"$f":"IF('２回目'!$W$51=\"\",\"\",'２回目'!$W$51)","v":3.3333333333333335}]
[null,{"$f":"IF('３回目'!$D$3=\"\",\"\",\"３回目\"&\" 『\"&'３回目'!$D$3&\"』\")","v":"３回目 『音のせいしつ』"},null,{"$f":"IF('３回目'!$D$2=\"\",\"\",'３回目'!$D$2)","v":"2025-11-15"},{"$f":"IF('３回目'!E$51=\"\",\"\",'３回目'!E$51)","v":4.5},{"$f":"IF('３回目'!F$51=\"\",\"\",'３回目'!F$51)","v":4.5},{"$f":"IF('３回目'!G$51=\"\",\"\",'３回目'!G$51)","v":4.5},{"$f":"IF('３回目'!H$51=\"\",\"\",'３回目'!H$51)","v":4},{"$f":"IF('３回目'!I$51=\"\",\"\",'３回目'!I$51)","v":4},{"$f":"IF('３回目'!J$51=\"\",\"\",'３回目'!J$51)","v":3.5},{"$f":"IF('３回目'!K$51=\"\",\"\",'３回目'!K$51)","v":3.5},{"$f":"IF('３回目'!L$51=\"\",\"\",'３回目'!L$51)","v":3},{"$f":"IF('３回目'!M$51=\"\",\"\",'３回目'!M$51)","v":3.5},{"$f":"IF('３回目'!N$51=\"\",\"\",'３回目'!N$51)","v":3.5},{"$f":"IF('３回目'!O$51=\"\",\"\",'３回目'!O$51)","v":3.5},{"$f":"IF('３回目'!P$51=\"\",\"\",'３回目'!P$51)","v":3.5},{"$f":"IF('３回目'!Q$51=\"\",\"\",'３回目'!Q$51)","v":3},{"$f":"IF('３回目'!R$51=\"\",\"\",'３回目'!R$51)","v":3.5},{"$f":"IF('３回目'!S$51=\"\",\"\",'３回目'!S$51)","v":3.5},null,"３回目",{"$f":"IF('３回目'!$D$2=\"\",\"\",'３回目'!$D$2)","v":"2025-11-15"},{"$f":"IF(VLOOKUP(印刷!$B$6,'３回目'!$A$5:$W$50,5,FALSE)=\"\",\"\",VLOOKUP(印刷!$B$6,'３回目'!$A$5:$W$50,5,FALSE))","v":5},{"$f":"IF(VLOOKUP(印刷!$B$6,'３回目'!$A$5:$W$50,6,FALSE)=\"\",\"\",VLOOKUP(印刷!$B$6,'３回目'!$A$5:$W$50,6,FALSE))","v":5},{"$f":"IF(VLOOKUP(印刷!$B$6,'３回目'!$A$5:$W$50,7,FALSE)=\"\",\"\",VLOOKUP(印刷!$B$6,'３回目'!$A$5:$W$50,7,FALSE))","v":5},{"$f":"IF(VLOOKUP(印刷!$B$6,'３回目'!$A$5:$W$50,8,FALSE)=\"\",\"\",VLOOKUP(印刷!$B$6,'３回目'!$A$5:$W$50,8,FALSE))","v":4},{"$f":"IF(VLOOKUP(印刷!$B$6,'３回目'!$A$5:$W$50,9,FALSE)=\"\",\"\",VLOOKUP(印刷!$B$6,'３回目'!$A$5:$W$50,9,FALSE))","v":4},{"$f":"IF(VLOOKUP(印刷!$B$6,'３回目'!$A$5:$W$50,10,FALSE)=\"\",\"\",VLOOKUP(印刷!$B$6,'３回目'!$A$5:$W$50,10,FALSE))","v":4},{"$f":"IF(VLOOKUP(印刷!$B$6,'３回目'!$A$5:$W$50,11,FALSE)=\"\",\"\",VLOOKUP(印刷!$B$6,'３回目'!$A$5:$W$50,11,FALSE))","v":4},{"$f":"IF(VLOOKUP(印刷!$B$6,'３回目'!$A$5:$W$50,12,FALSE)=\"\",\"\",VLOOKUP(印刷!$B$6,'３回目'!$A$5:$W$50,12,FALSE))","v":3},{"$f":"IF(VLOOKUP(印刷!$B$6,'３回目'!$A$5:$W$50,13,FALSE)=\"\",\"\",VLOOKUP(印刷!$B$6,'３回目'!$A$5:$W$50,13,FALSE))","v":4},{"$f":"IF(VLOOKUP(印刷!$B$6,'３回目'!$A$5:$W$50,14,FALSE)=\"\",\"\",VLOOKUP(印刷!$B$6,'３回目'!$A$5:$W$50,14,FALSE))","v":4},{"$f":"IF(VLOOKUP(印刷!$B$6,'３回目'!$A$5:$W$50,15,FALSE)=\"\",\"\",VLOOKUP(印刷!$B$6,'３回目'!$A$5:$W$50,15,FALSE))","v":4},{"$f":"IF(VLOOKUP(印刷!$B$6,'３回目'!$A$5:$W$50,16,FALSE)=\"\",\"\",VLOOKUP(印刷!$B$6,'３回目'!$A$5:$W$50,16,FALSE))","v":4},{"$f":"IF(VLOOKUP(印刷!$B$6,'３回目'!$A$5:$W$50,17,FALSE)=\"\",\"\",VLOOKUP(印刷!$B$6,'３回目'!$A$5:$W$50,17,FALSE))","v":3},{"$f":"IF(VLOOKUP(印刷!$B$6,'３回目'!$A$5:$W$50,18,FALSE)=\"\",\"\",VLOOKUP(印刷!$B$6,'３回目'!$A$5:$W$50,18,FALSE))","v":4},{"$f":"IF(VLOOKUP(印刷!$B$6,'３回目'!$A$5:$W$50,19,FALSE)=\"\",\"\",VLOOKUP(印刷!$B$6,'３回目'!$A$5:$W$50,19,FALSE))","v":4},null,"３回目",{"$f":"IF(VLOOKUP(印刷!$B$6,'３回目'!$A$5:$W$50,20,FALSE)=\"\",\"\",VLOOKUP(印刷!$B$6,'３回目'!$A$5:$W$50,20,FALSE))","v":4.4285714285714288},{"$f":"IF(VLOOKUP(印刷!$B$6,'３回目'!$A$5:$W$50,21,FALSE)=\"\",\"\",VLOOKUP(印刷!$B$6,'３回目'!$A$5:$W$50,21,FALSE))","v":3.8},{"$f":"IF(VLOOKUP(印刷!$B$6,'３回目'!$A$5:$W$50,22,FALSE)=\"\",\"\",VLOOKUP(印刷!$B$6,'３回目'!$A$5:$W$50,22,FALSE))","v":3.75},{"$f":"IF(VLOOKUP(印刷!$B$6,'３回目'!$A$5:$W$50,23,FALSE)=\"\",\"\",VLOOKUP(印刷!$B$6,'３回目'!$A$5:$W$50,23,FALSE))","v":4.0666666666666664},null,null,{"$f":"IF('３回目'!$D$3=\"\",\"\",\"３回目\"&\" 『\"&'３回目'!$D$3&\"』\")","v":"３回目 『音のせいしつ』"},null,{"$f":"IF('３回目'!$D$2=\"\",\"\",'３回目'!$D$2)","v":"2025-11-15"},{"$f":"IF('３回目'!$T$51=\"\",\"\",'３回目'!$T$51)","v":4.0714285714285712},{"$f":"IF('３回目'!$U$51=\"\",\"\",'３回目'!$U$51)","v":3.4},{"$f":"IF('３回目'!$V$51=\"\",\"\",'３回目'!$V$51)","v":3.375},{"$f":"IF('３回目'!$W$51=\"\",\"\",'３回目'!$W$51)","v":3.7}]
{"$rows_left_out":3}
{"sheet":"素朴概念集","index":14,"n_rows":47,"n_cols":18,"rows_kept":47,"cut":false,"hidden":false,"merged":[[30,0,40,0],[37,1,40,1],[39,2,40,2],[39,4,40,4],[26,4,27,4],[26,3,28,3],[30,3,31,3],[34,3,36,3],[39,6,40,6],[30,1,31,1],[32,1,34,1],[32,3,33,3],[35,1,36,1],[16,1,19,1],[18,3,20,3],[20,1,23,1],[9,1,13,1],[9,3,10,3],[12,2,13,2],[11,3,13,3],[21,3,23,3],[5,3,6,3],[5,16,6,16],[12,8,13,8],[12,11,13,11],[12,14,13,14],[12,4,13,4],[12,5,13,5],[12,10,13,10],[12,12,13,12],[5,7,6,7],[5,9,6,9],[5,10,6,10],[5,13,6,13],[12,7,13,7],[12,9,13,9],[5,8,6,8],[26,5,27,5],[21,2,22,2],[21,4,22,4],[21,5,22,5],[3,0,14,0],[16,0,22,0],[24,1,28,1],[24,3,25,3],[26,2,27,2],[3,1,5,1],[6,1,8,1],[7,3,8,3],[23,0,28,0],[5,2,6,2],[5,4,6,4],[5,5,6,5],[5,11,6,11],[5,18,6,18],[5,15,6,15],[5,12,6,12],[12,18,13,18],[12,16,13,16],[12,13,13,13],[12,15,13,15],[5,14,6,14],[5,17,6,17],[12,17,13,17]]}
[]
["素朴概念集"]
["期","月","教科書＊1のページ","単元名\n●地域によって授業を行う順番が前後する単元、〇応用、★…他教科との関連","時数","節タイトル名","学習指導要領の内容",null,"小学校指導要領解説\n理科編　より",null,null,"素朴概念",null,null,"素朴概念体験活動例\n※LT…レッツトライ！",null,null,"素朴概念とのずれ"]
["前　期（44時間）",4,"1～5","●巻頭 ",1]
[null,null,"6～13","1．春の生き物\n★他教科との関連\n：生活科",5,"①生き物のすがた","B(1)ア(ｱ)、イ",null,"生物は、色、形、大きさなど、姿に違いがあること。",null,null,"生物はすべて動いている。\n植物は動かないから生きていない。\n生物の色の違いはすべて環境によるものである（実際はコミュニケーションや体温調節のためでもある）。\n生物の大きさの違いは年齢の違いである（実際は品種の違いによるもの）。＊5",null,null,"春の生き物をさがす。(LT)",null,null,"水を吸収して葉が元気になる映像教材を見せる。\nカメレオンの色の変化を観察する映像教材を見せる。"]
[null,null,"14～21","2．たねまき\n★他教科との関連\n：生活科","3(4)","①たねをまこう","B(1)ア(ｳ)、イ",null,"植物の育ち方には一定の順序があること。",null,null,"子葉はどの植物も同じ形である。\n植物は「根→茎→葉→花→実」の順番で育つ。\n種は必ず土の中で育つ。",null,null,"いろいろな植物の種を観察する。(LT)",null,null,"種が植物によって違うことから、芽が出た後の様子を予想させる。\nもやしの発芽の映像教材を見せて、芽が出るときは必ずしも土の中から出るわけではないことを確認する。"]
{"$rows_left_out":42}
{"sheet":"ファシリテーション集","index":15,"n_rows":15,"n_cols":9,"rows_kept":15,"cut":false,"hidden":false,"merged":[]}
[]
[null,"ファシリテーション集"]
[null,"問題解決の過程","学習シート","板書スライド","アンケート","分析して解釈する力","指導上の留意点","予想される児童の学習状況","予想される児童の学習状況への声掛けの例"]
[null,"(自然事象との出会い)\n[素朴概念体験活動]","－","０ 「〇〇」で遊ぼう",null,"－"]
[null,"(自然事象との出会い)\n[素朴概念の確認]","－","１　「自分が知ってい\n　　ること」を思い出\n　　そう","Ｑ１　児童が授業中に、「授業に関\n　　　係する知識や体験」を思い出\n　　　すための活動","－"]
[null,"－","－","２　今日のじゅぎょう\n　　のテーマをかくに\n　　んしよう",null,"－"]
{"$rows_left_out":9}